{"text_format":"1","workbook":"xlsx","n_sheets":14,"sheets":["Note for the TA","Instructions","Dashboard","Data ---->","2018 NYT BSL","2019 NYT BSL","2020 NYT BSL","2021 NYT BSL","Backup----->","Sheet2","Sheet4","Time Tracker","Sheet1","VBA"],"not_rendered":{"charts":0,"images":1,"macros":1,"external_links":0,"defined_names":12,"comments":1,"pivot_tables":0},"unopened":[],"bounds":{"document_bytes":16777216,"sheet_cells":100000,"rows_first":2000,"rows_last":500,"rows_between":2000,"halvings":0,"cell_chars":16384,"cell_head_chars":4096},"cells_cut":0,"cells_raw":0,"read":"whole","date_system":"1900"}

{"sheet":"Note for the TA","index":0,"n_rows":0,"n_cols":0,"rows_kept":0,"cut":false,"hidden":false,"merged":[]}

{"sheet":"Instructions","index":1,"n_rows":0,"n_cols":0,"rows_kept":0,"cut":false,"hidden":false,"merged":[]}

{"sheet":"Dashboard","index":2,"n_rows":32,"n_cols":17,"rows_kept":32,"cut":false,"hidden":false,"merged":[[1,0,1,3]]}
[null,null,null,null,null,null,"Books",null,"Genre",null,"Listed Paperback Price"]
["Find the Year and Author you want to Know about",null,null,null,null,1,{"$f":"IFERROR(_xlfn.UNIQUE(IF($B$4=2018,_xlfn._xlws.FILTER(Table_0__4[Column1],Table_0__4[Author]=Dashboard!$D$4),IF($B$4=2019,_xlfn._xlws.FILTER(Table_0__3[Column1],Table_0__3[Author]=Dashboard!$D$4),IF(Dashboard!$B$4=2020,_xlfn._xlws.FILTER(Table_0__2[Column1],Table_0__2[Author]=Dashboard!$D$4),IF(Dashboard!$B$4=2021,_xlfn._xlws.FILTER(Table_0[Column2],Table_0[Author]=Dashboard!$D$4),\"\"))))),\"No Book Listed\")","v":"Where the Crawdads Sing"},null,{"$f":"IFERROR(IF($B$4=2018,VLOOKUP($G$2,Table_0__4[[Column1]:[Price]],3,FALSE),IF(Dashboard!$B$4=2019,VLOOKUP(Dashboard!$G$2,Table_0__3[[Column1]:[Price]],3,FALSE),IF(Dashboard!$B$4=2020,VLOOKUP(Dashboard!$G$2,Table_0__2[[Column1]:[Price]],3,FALSE),IF(Dashboard!$B$4=2021,VLOOKUP(Dashboard!$G$2,Table_0[[Column2]:[Price]],3,FALSE),\"\")))),\"No Book Listed\")","v":"Romance Novel"},null,{"$f":"IFERROR(IF($B$4=2018,VLOOKUP($G2,Table_0__4[[Column1]:[Price]],4,FALSE),IF(Dashboard!$B$4=2019,VLOOKUP(Dashboard!$G2,Table_0__3[[Column1]:[Price]],4,FALSE),IF(Dashboard!$B$4=2020,VLOOKUP(Dashboard!$G2,Table_0__2[[Column1]:[Price]],4,FALSE),IF(Dashboard!$B$4=2021,VLOOKUP(Dashboard!$G2,Table_0[[Column2]:[Price]],4,FALSE),\"\")))),\"No Book Listed\")","v":18}]
[null,"Year",null,"Author",null,2,null,null,{"$f":"IFERROR(IF($B$4=2018,VLOOKUP($G3,Table_0__4[[Column1]:[Price]],3,FALSE),IF(Dashboard!$B$4=2019,VLOOKUP(Dashboard!$G3,Table_0__3[[Column1]:[Price]],3,FALSE),IF(Dashboard!$B$4=2020,VLOOKUP(Dashboard!$G3,Table_0__2[[Column1]:[Price]],3,FALSE),IF(Dashboard!$B$4=2021,VLOOKUP(Dashboard!$G3,Table_0[[Column2]:[Price]],3,FALSE),\"\")))),\"\")","v":""},null,{"$f":"IFERROR(IF($B$4=2018,VLOOKUP($G3,Table_0__4[[Column1]:[Price]],4,FALSE),IF(Dashboard!$B$4=2019,VLOOKUP(Dashboard!$G3,Table_0__3[[Column1]:[Price]],4,FALSE),IF(Dashboard!$B$4=2020,VLOOKUP(Dashboard!$G3,Table_0__2[[Column1]:[Price]],4,FALSE),IF(Dashboard!$B$4=2021,VLOOKUP(Dashboard!$G3,Table_0[[Column2]:[Price]],4,FALSE),\"\")))),\"\")","v":""}]
[2,2019,null,"Delia Owens",null,3,null,null,{"$f":"IFERROR(IF($B$4=2018,VLOOKUP($G4,Table_0__4[[Column1]:[Price]],3,FALSE),IF(Dashboard!$B$4=2019,VLOOKUP(Dashboard!$G4,Table_0__3[[Column1]:[Price]],3,FALSE),IF(Dashboard!$B$4=2020,VLOOKUP(Dashboard!$G4,Table_0__2[[Column1]:[Price]],3,FALSE),IF(Dashboard!$B$4=2021,VLOOKUP(Dashboard!$G4,Table_0[[Column2]:[Price]],3,FALSE),\"\")))),\"\")","v":""},null,{"$f":"IFERROR(IF($B$4=2018,VLOOKUP($G4,Table_0__4[[Column1]:[Price]],4,FALSE),IF(Dashboard!$B$4=2019,VLOOKUP(Dashboard!$G4,Table_0__3[[Column1]:[Price]],4,FALSE),IF(Dashboard!$B$4=2020,VLOOKUP(Dashboard!$G4,Table_0__2[[Column1]:[Price]],4,FALSE),IF(Dashboard!$B$4=2021,VLOOKUP(Dashboard!$G4,Table_0[[Column2]:[Price]],4,FALSE),\"\")))),\"\")","v":""}]
["Input","Output",null,null,null,4,null,null,{"$f":"IFERROR(IF($B$4=2018,VLOOKUP($G5,Table_0__4[[Column1]:[Price]],3,FALSE),IF(Dashboard!$B$4=2019,VLOOKUP(Dashboard!$G5,Table_0__3[[Column1]:[Price]],3,FALSE),IF(Dashboard!$B$4=2020,VLOOKUP(Dashboard!$G5,Table_0__2[[Column1]:[Price]],3,FALSE),IF(Dashboard!$B$4=2021,VLOOKUP(Dashboard!$G5,Table_0[[Column2]:[Price]],3,FALSE),\"\")))),\"\")","v":""},null,{"$f":"IFERROR(IF($B$4=2018,VLOOKUP($G5,Table_0__4[[Column1]:[Price]],4,FALSE),IF(Dashboard!$B$4=2019,VLOOKUP(Dashboard!$G5,Table_0__3[[Column1]:[Price]],4,FALSE),IF(Dashboard!$B$4=2020,VLOOKUP(Dashboard!$G5,Table_0__2[[Column1]:[Price]],4,FALSE),IF(Dashboard!$B$4=2021,VLOOKUP(Dashboard!$G5,Table_0[[Column2]:[Price]],4,FALSE),\"\")))),\"\")","v":""}]
[]
[null,"Dates Book 1 was on Top",null,"Weeks it was up",null,null,"Dates Book 2 was on Top",null,"Weeks it was up",null,"Dates Book 3 was on Top",null,"Weeks it was up",null,"Dates Book 4 was on Top",null,"Weeks it was up"]
[null,{"$f":"IFERROR(IF($B$4=2018,_xlfn._xlws.FILTER(Table_0__4[Column2],Table_0__4[Column1]=Dashboard!$G$2),IF($B$4=2019,_xlfn._xlws.FILTER(Table_0__3[Column2],Table_0__3[Column1]=Dashboard!$G$2),IF($B$4=2020,_xlfn._xlws.FILTER(Table_0__2[Column2],Table_0__2[Column1]=Dashboard!$G$2),IF($B$4=2021,_xlfn._xlws.FILTER(Table_0[Column1],Table_0[Column2]=Dashboard!$G$2))))),\"No Book Listed\")","v":"2021-02-03"},null,{"$f":"IF(COUNT(B8:B32)=0,\"No Book Listed\",COUNT(B8:B32))","v":25},null,null,{"$f":"IFERROR(IF($B$4=2018,_xlfn._xlws.FILTER(Table_0__4[Column2],Table_0__4[Column1]=$G$3),IF($B$4=2019,_xlfn._xlws.FILTER(Table_0__3[Column2],Table_0__3[Column1]=$G$3),IF($B$4=2020,_xlfn._xlws.FILTER(Table_0__2[Column2],Table_0__2[Column1]=$G$3),IF($B$4=2021,_xlfn._xlws.FILTER(Table_0[Column1],Table_0[Column2]=$G$3))))),\"No Book Listed\")","v":"No Book Listed"},null,{"$f":"IF(COUNT(G8:G32)=0,\"No Book Listed\",COUNT(G8:G32))","v":"No Book Listed"},null,{"$f":"IFERROR(IF($B$4=2018,_xlfn._xlws.FILTER(Table_0__4[Column2],Table_0__4[Column1]=$G$4),IF($B$4=2019,_xlfn._xlws.FILTER(Table_0__3[Column2],Table_0__3[Column1]=$G$4),IF($B$4=2020,_xlfn._xlws.FILTER(Table_0__2[Column2],Table_0__2[Column1]=$G$4),IF($B$4=2021,_xlfn._xlws.FILTER(Table_0[Column1],Table_0[Column2]=$G$4))))),\"No Book Listed\")","v":"No Book Listed"},null,{"$f":"IF(COUNT(K8:K32)=0,\"No Book Listed\",COUNT(K8:K32))","v":"No Book Listed"},null,{"$f":"IFERROR(IF($B$4=2018,_xlfn._xlws.FILTER(Table_0__4[Column2],Table_0__4[Column1]=$G$5),IF($B$4=2019,_xlfn._xlws.FILTER(Table_0__3[Column2],Table_0__3[Column1]=$G$5),IF($B$4=2020,_xlfn._xlws.FILTER(Table_0__2[Column2],Table_0__2[Column1]=$G$5),IF($B$4=2021,_xlfn._xlws.FILTER(Table_0[Column1],Table_0[Column2]=$G$5))))),\"No Book Listed\")","v":"No Book Listed"},null,{"$f":"IF(COUNT(O8:O32)=0,\"No Book Listed\",COUNT(O8:O32))","v":"No Book Listed"}]
[null,"2021-02-10"]
[null,"2021-02-17"]
{"$rows_left_out":23}
{"sheet":"Data ---->","index":3,"n_rows":0,"n_cols":0,"rows_kept":0,"cut":false,"hidden":false,"merged":[]}

{"sheet":"2018 NYT BSL","index":4,"n_rows":53,"n_cols":11,"rows_kept":53,"cut":false,"hidden":false,"merged":[]}
["Date","Book","Author","Column1","Column2","Genre","Price"]
["2018-01-07","Origin","Dan Brown",{"$f":"Table_0__4[[#This Row],[Book]]","v":"Origin"},{"$f":"Table_0__4[[#This Row],[Date]]","v":"2018-01-07"},"Crime Mystery Novel",8.35,null,"Dan Brown",null,{"$f":"_xlfn.UNIQUE(Table_0__4[Genre])","v":"Crime Mystery Novel"}]
["2018-01-14","The People vs. Alex Cross","James Patterson",{"$f":"Table_0__4[[#This Row],[Book]]","v":"The People vs. Alex Cross"},{"$f":"Table_0__4[[#This Row],[Date]]","v":"2018-01-14"},"Thriller Fiction",9.99,null,"James Patterson",null,"Thriller Fiction"]
["2018-01-21","The Woman in the Window","A.J. Finn",{"$f":"Table_0__4[[#This Row],[Book]]","v":"The Woman in the Window"},{"$f":"Table_0__4[[#This Row],[Date]]","v":"2018-01-21"},"Thriller Fiction Novel",6.25,null,"A.J. Finn",null,"Thriller Fiction Novel"]
["2018-01-28","The Woman in the Window","A.J. Finn",{"$f":"Table_0__4[[#This Row],[Book]]","v":"The Woman in the Window"},{"$f":"Table_0__4[[#This Row],[Date]]","v":"2018-01-28"},"Thriller Fiction Novel",6.25,null,"Douglas Preston and Lincoln Child",null,"Mystery Thriller Fiction"]
["2018-02-04","City of Endless Night","Douglas Preston and Lincoln Child",{"$f":"Table_0__4[[#This Row],[Book]]","v":"City of Endless Night"},{"$f":"Table_0__4[[#This Row],[Date]]","v":"2018-02-04"},"Mystery Thriller Fiction",9.99,null,"Christine Feehan",null,"Romance Novel"]
["2018-02-11","Judgment Road","Christine Feehan",{"$f":"Table_0__4[[#This Row],[Book]]","v":"Judgment Road"},{"$f":"Table_0__4[[#This Row],[Date]]","v":"2018-02-11"},"Romance Novel",7.99,null,"J.D. Robb",null,"Mystery Suspense Novel"]
["2018-02-18","Dark in Death","J.D. Robb",{"$f":"Table_0__4[[#This Row],[Book]]","v":"Dark in Death"},{"$f":"Table_0__4[[#This Row],[Date]]","v":"2018-02-18"},"Mystery Suspense Novel",5.87,null,"Kristin Hannah",null,"Domestic Fiction Novel"]
["2018-02-25","The Great Alone","Kristin Hannah",{"$f":"Table_0__4[[#This Row],[Book]]","v":"The Great Alone"},{"$f":"Table_0__4[[#This Row],[Date]]","v":"2018-02-25"},"Domestic Fiction Novel",11.74,null,"Patricia Briggs",null,"Supernatural Fiction"]
["2018-03-04","The Great Alone","Kristin Hannah",{"$f":"Table_0__4[[#This Row],[Book]]","v":"The Great Alone"},{"$f":"Table_0__4[[#This Row],[Date]]","v":"2018-03-04"},"Domestic Fiction Novel",11.74,null,"Clive Cussler and Graham Brown",null,"Thriller"]
{"$rows_left_out":44}
{"sheet":"2019 NYT BSL","index":5,"n_rows":53,"n_cols":9,"rows_kept":53,"cut":false,"hidden":false,"merged":[]}
["Date","Book","Author","Column1","Column2","Genre","Price"]
["2021-01-06","The Reckoning","John Grisham",{"$f":"Table_0__3[[#This Row],[Book]]","v":"The Reckoning"},{"$f":"Table_0__3[[#This Row],[Date]]","v":"2021-01-06"},"Thriller Novel",17,null,"John Grisham"]
["2021-01-13","Long Road to Mercy","David Baldacci",{"$f":"Table_0__3[[#This Row],[Book]]","v":"Long Road to Mercy"},{"$f":"Table_0__3[[#This Row],[Date]]","v":"2021-01-13"},"Thriller Novel",9.99,null,"David Baldacci"]
["2021-01-20","Verses for the Dead","Douglas Preston and Lincoln Child",{"$f":"Table_0__3[[#This Row],[Book]]","v":"Verses for the Dead"},{"$f":"Table_0__3[[#This Row],[Date]]","v":"2021-01-20"},"Thriller Novel",15.91,null,"Douglas Preston and Lincoln Child"]
["2021-01-27","Turning Point","Danielle Steel",{"$f":"Table_0__3[[#This Row],[Book]]","v":"Turning Point"},{"$f":"Table_0__3[[#This Row],[Date]]","v":"2021-01-27"},"Romance Novel",7.34,null,"Danielle Steel"]
["2021-02-03","Where the Crawdads Sing","Delia Owens",{"$f":"Table_0__3[[#This Row],[Book]]","v":"Where the Crawdads Sing"},{"$f":"Table_0__3[[#This Row],[Date]]","v":"2021-02-03"},"Romance Novel",18,null,"Delia Owens"]
["2021-02-10","Where the Crawdads Sing","Delia Owens",{"$f":"Table_0__3[[#This Row],[Book]]","v":"Where the Crawdads Sing"},{"$f":"Table_0__3[[#This Row],[Date]]","v":"2021-02-10"},"Romance Novel",18,null,"J. D. Robb"]
["2021-02-17","Where the Crawdads Sing","Delia Owens",{"$f":"Table_0__3[[#This Row],[Book]]","v":"Where the Crawdads Sing"},{"$f":"Table_0__3[[#This Row],[Date]]","v":"2021-02-17"},"Romance Novel",18,null,"John Sandford"]
["2021-02-24","Connections in Death","J. D. Robb",{"$f":"Table_0__3[[#This Row],[Book]]","v":"Connections in Death"},{"$f":"Table_0__3[[#This Row],[Date]]","v":"2021-02-24"},"Thriller Mystery Novel",8.99,null,"James Patterson and Maxine Paetro"]
["2021-03-03","Where the Crawdads Sing","Delia Owens",{"$f":"Table_0__3[[#This Row],[Book]]","v":"Where the Crawdads Sing"},{"$f":"Table_0__3[[#This Row],[Date]]","v":"2021-03-03"},"Romance Novel",18,null,"Elin Hilderbrand"]
{"$rows_left_out":44}
{"sheet":"2020 NYT BSL","index":6,"n_rows":53,"n_cols":9,"rows_kept":53,"cut":false,"hidden":false,"merged":[]}
["Date","Book","Author","Column1","Column2","Genre","Price"]
["2020-01-05","Where the Crawdads Sing","Delia Owens",{"$f":"Table_0__2[[#This Row],[Book]]","v":"Where the Crawdads Sing"},{"$f":"Table_0__2[[#This Row],[Date]]","v":"2020-01-05"},"Romance Novel",18,null,"Delia Owens"]
["2020-01-12","Where the Crawdads Sing","Delia Owens",{"$f":"Table_0__2[[#This Row],[Book]]","v":"Where the Crawdads Sing"},{"$f":"Table_0__2[[#This Row],[Date]]","v":"2020-01-12"},"Romance Novel",18,null,"Jeanine Cummins"]
["2020-01-19","Where the Crawdads Sing","Delia Owens",{"$f":"Table_0__2[[#This Row],[Book]]","v":"Where the Crawdads Sing"},{"$f":"Table_0__2[[#This Row],[Date]]","v":"2020-01-19"},"Romance Novel",18,null,"J.D. Robb"]
["2020-01-26","Where the Crawdads Sing","Delia Owens",{"$f":"Table_0__2[[#This Row],[Book]]","v":"Where the Crawdads Sing"},{"$f":"Table_0__2[[#This Row],[Date]]","v":"2020-01-26"},"Romance Novel",18,null,"Mark Greaney"]
["2020-02-02","Where the Crawdads Sing","Delia Owens",{"$f":"Table_0__2[[#This Row],[Book]]","v":"Where the Crawdads Sing"},{"$f":"Table_0__2[[#This Row],[Date]]","v":"2020-02-02"},"Romance Novel",18,null,"James Patterson and James O. Born"]
["2020-02-09","American Dirt","Jeanine Cummins",{"$f":"Table_0__2[[#This Row],[Book]]","v":"American Dirt"},{"$f":"Table_0__2[[#This Row],[Date]]","v":"2020-02-09"},"Thriller Fiction",17.989999999999998,null,"Sarah J. Maas"]
["2020-02-16","American Dirt","Jeanine Cummins",{"$f":"Table_0__2[[#This Row],[Book]]","v":"American Dirt"},{"$f":"Table_0__2[[#This Row],[Date]]","v":"2020-02-16"},"Thriller Fiction",17.989999999999998,null,"Hilary Mantel"]
["2020-02-23","Golden in Death","J.D. Robb",{"$f":"Table_0__2[[#This Row],[Book]]","v":"Golden in Death"},{"$f":"Table_0__2[[#This Row],[Date]]","v":"2020-02-23"},"Thriller Mystery Fiction",8.99,null,"Harlan Coben"]
["2020-03-01","American Dirt","Jeanine Cummins",{"$f":"Table_0__2[[#This Row],[Book]]","v":"American Dirt"},{"$f":"Table_0__2[[#This Row],[Date]]","v":"2020-03-01"},"Thriller Fiction",17.989999999999998,null,"Celeste Ng"]
{"$rows_left_out":44}
{"sheet":"2021 NYT BSL","index":7,"n_rows":30,"n_cols":10,"rows_kept":30,"cut":false,"hidden":false,"merged":[]}
["Date","Book","Author","Column2","Column1","Genre","Price","Publisher"]
["2021-01-03","A Time for Mercy","John Grisham",{"$f":"Table_0[[#This Row],[Book]]","v":"A Time for Mercy"},{"$f":"Table_0[[#This Row],[Date]]","v":"2021-01-03"},"Thriller Fiction",18,"Doubleday",null,"John Grisham"]
["2021-01-10","A Time for Mercy","John Grisham",{"$f":"Table_0[[#This Row],[Book]]","v":"A Time for Mercy"},{"$f":"Table_0[[#This Row],[Date]]","v":"2021-01-10"},"Thriller Fiction",18,"Doubleday",null,"Julia Quinn"]
["2021-01-17","The Duke and I","Julia Quinn",{"$f":"Table_0[[#This Row],[Book]]","v":"The Duke and I"},{"$f":"Table_0[[#This Row],[Date]]","v":"2021-01-17"},"Romance Novel",16.989999999999998,"Avon",null,"James Patterson and James O. Born"]
["2021-01-24","The Duke and I","Julia Quinn",{"$f":"Table_0[[#This Row],[Book]]","v":"The Duke and I"},{"$f":"Table_0[[#This Row],[Date]]","v":"2021-01-24"},"Romance Novel",16.989999999999998,"Avon",null,"Kristin Hannah"]
["2021-01-31","The Duke and I","Julia Quinn",{"$f":"Table_0[[#This Row],[Book]]","v":"The Duke and I"},{"$f":"Table_0[[#This Row],[Date]]","v":"2021-01-31"},"Romance Novel",16.989999999999998,"Avon",null,"Sarah J. Maas"]
["2021-02-07","The Duke and I","Julia Quinn",{"$f":"Table_0[[#This Row],[Book]]","v":"The Duke and I"},{"$f":"Table_0[[#This Row],[Date]]","v":"2021-02-07"},"Romance Novel",16.989999999999998,"Avon",null,"Sister Souljah"]
["2021-02-14","The Russian","James Patterson and James O. Born",{"$f":"Table_0[[#This Row],[Book]]","v":"The Russian"},{"$f":"Table_0[[#This Row],[Date]]","v":"2021-02-14"},"Thriller Fiction",20.57,"Little, Brown and Company",null,"Harlen Coben"]
["2021-02-21","The Four Winds","Kristin Hannah",{"$f":"Table_0[[#This Row],[Book]]","v":"The Four Winds"},{"$f":"Table_0[[#This Row],[Date]]","v":"2021-02-21"},"Historical Fiction Novel",19.420000000000002,"St. Martin's Press",null,"Amanda Gorman"]
["2021-02-28","The Four Winds","Kristin Hannah",{"$f":"Table_0[[#This Row],[Book]]","v":"The Four Winds"},{"$f":"Table_0[[#This Row],[Date]]","v":"2021-02-28"},"Historical Fiction Novel",19.420000000000002,"St. Martin's Press",null,"John Sandford"]
{"$rows_left_out":21}
{"sheet":"Backup----->","index":8,"n_rows":0,"n_cols":0,"rows_kept":0,"cut":false,"hidden":false,"merged":[]}

{"sheet":"Sheet2","index":9,"n_rows":54,"n_cols":19,"rows_kept":54,"cut":false,"hidden":false,"merged":[[36,2,38,2],[36,3,38,3],[4,2,5,2],[4,3,5,3],[9,2,12,2],[9,3,12,3],[21,2,22,2],[21,3,22,3],[22,6,27,6],[22,7,27,7],[26,2,31,2],[26,3,31,3],[33,2,34,2],[33,3,34,3],[0,1,0,3],[6,6,8,6],[6,7,8,7],[10,6,18,6],[10,7,18,7],[47,6,48,6],[47,7,48,7],[0,5,0,7],[2,10,6,10],[2,11,6,11],[7,10,8,10],[7,11,8,11],[16,10,18,10],[16,11,18,11],[23,10,24,10],[29,6,30,6],[29,7,30,7],[34,6,37,6],[34,7,37,7],[40,6,41,6],[40,7,41,7],[51,10,53,10],[51,11,53,11],[0,9,0,11],[2,14,3,14],[17,14,18,14],[23,11,24,11],[28,10,29,10],[28,11,29,11],[30,10,31,10],[30,11,31,11],[35,10,36,10],[35,11,36,11],[9,14,10,14],[9,15,10,15],[9,16,10,16],[45,10,46,10],[45,11,46,11],[0,13,0,16],[2,15,3,15],[2,16,3,16],[4,14,7,14],[4,15,7,15],[4,16,7,16],[17,15,18,15],[17,16,18,16],[27,14,28,14],[27,15,28,15],[27,16,28,16]]}
[null,2018,null,null,null,2019,null,null,null,2020,null,null,null,2021]
[null,"Date","Book","Author",null,"Date","Book","Author",null,"Date","Book","Author",null,"Date","Book","Author","Publisher"]
[null,"2021-01-07","Origin","Dan Brown",null,"2021-01-06","The Reckoning","John Grisham",null,"2021-01-05","Where the Crawdads Sing","Delia Owens",null,"2021-01-03","A Time for Mercy","John Grisham","Doubleday",null,2018]
[null,"2021-01-14","The People vs. Alex Cross","James Patterson",null,"2021-01-13","Long Road to Mercy","David Baldacci",null,"2021-01-12",null,null,null,"2021-01-10",null,null,null,null,2019]
[null,"2021-01-21","The Woman in the Window","A.J. Finn",null,"2021-01-20","Verses for the Dead","Douglas Preston and Lincoln Child",null,"2021-01-19",null,null,null,"2021-01-17","The Duke and I","Julia Quinn","Avon",null,2020]
[null,"2021-01-28",null,null,null,"2021-01-27","Turning Point","Danielle Steel",null,"2021-01-26",null,null,null,"2021-01-24",null,null,null,null,2021]
[null,"2021-02-04","City of Endless Night","Douglas Preston and Lincoln Child",null,"2021-02-03","Where the Crawdads Sing","Delia Owens",null,"2021-02-02",null,null,null,"2021-01-31"]
[null,"2021-02-11","Judgment Road","Christine Feehan",null,"2021-02-10",null,null,null,"2021-02-09","American Dirt","Jeanine Cummins",null,"2021-02-07"]
[null,"2021-02-18","Dark in Death","J.D. Robb",null,"2021-02-17",null,null,null,"2021-02-16",null,null,null,"2021-02-14","The Russian","James Patterson and James O. Born","Little, Brown and Company"]
[null,"2021-02-25","The Great Alone","Kristin Hannah",null,"2021-02-24","Connections in Death","J. D. Robb",null,"2021-02-23","Golden in Death","J.D. Robb",null,"2021-02-21","The Four Winds","Kristin Hannah","St. Martin's Press"]
{"$rows_left_out":45}
{"sheet":"Sheet4","index":10,"n_rows":69,"n_cols":7,"rows_kept":69,"cut":false,"hidden":false,"merged":[]}
[null,null,"Books",null,"Genres"]
[null,"Authors",null,null,{"$f":"_xlfn.UNIQUE(Table_0__4[Genre])","v":"Crime Mystery Novel"},null,{"$f":"_xlfn.UNIQUE(E2:E69)","v":"Crime Mystery Novel"}]
[null,"Dan Brown","Origin",null,"Thriller Fiction",null,"Thriller Fiction"]
[null,"James Patterson","The People vs. Alex Cross",null,"Thriller Fiction Novel",null,"Thriller Fiction Novel"]
[null,"A.J. Finn",null,null,"Mystery Thriller Fiction",null,"Mystery Thriller Fiction"]
[null,"Douglas Preston and Lincoln Child",null,null,"Romance Novel",null,"Romance Novel"]
[null,"Christine Feehan",{"$f":"IFERROR(IF(Dashboard!$B$4=2018,VLOOKUP(Dashboard!$D$5,Table_0__4[[Author]:[Column2]],3,FALSE),IF(Dashboard!$B$4=2019,VLOOKUP(Dashboard!$D$5,Table_0__3[[Author]:[Column2]],3,FALSE),IF(Dashboard!$B$4=2020,VLOOKUP(Dashboard!$D$5,Table_0__2[[Author]:[Column2]],3,FALSE),IF(Dashboard!$B$4=2021,VLOOKUP(Dashboard!$D$5,'2021 NYT BSL'!#REF!,3,FALSE),\"\")))),\"No Book\")","v":"No Book"},null,"Mystery Suspense Novel",null,"Mystery Suspense Novel"]
[null,"J.D. Robb",{"$f":"IFERROR(IF(Dashboard!$B$4=2018,VLOOKUP(Dashboard!$D$5,Table_0__4[[Author]:[Column2]],2,FALSE),IF(Dashboard!$B$4=2019,VLOOKUP(Dashboard!$D$5,Table_0__3[[Author]:[Column2]],2,FALSE),IF(Dashboard!$B$4=2020,VLOOKUP(Dashboard!$D$5,Table_0__2[[Author]:[Column2]],2,FALSE),IF(Dashboard!$B$4=2021,VLOOKUP(Dashboard!$D$5,Table_0[[Author]:[Column1]],2,FALSE),\"\")))),\"No Book\")","v":"No Book"},null,"Domestic Fiction Novel",null,"Domestic Fiction Novel"]
[null,"Kristin Hannah",null,null,"Supernatural Fiction",null,"Supernatural Fiction"]
[null,"Patricia Briggs",null,null,"Thriller",null,"Thriller"]
{"$rows_left_out":60}
{"sheet":"Time Tracker","index":11,"n_rows":6,"n_cols":3,"rows_kept":6,"cut":false,"hidden":false,"merged":[]}
[]
[null,"2021-07-07","25 min"]
[null,"2021-07-08","1 hr"]
[null,"2021-07-12","45 min"]
[null,"2021-07-13","4 hr"]
[null,"2021-07-14","2 hr"]

{"sheet":"Sheet1","index":12,"n_rows":2,"n_cols":1,"rows_kept":2,"cut":false,"hidden":false,"merged":[[0,0,0,6],[1,0,1,6]]}
["HONESTY WARNING (do not edit, hide, or move this)"]
["BEFORE you do anything with this file, CLICK HERE and carefully read"]

{"sheet":"VBA","index":13,"n_rows":2,"n_cols":1,"rows_kept":2,"cut":false,"hidden":true,"merged":[]}
["Spring 2021"]
["Harrell-02"]